Reaction Details
TargetAmine oxidase [flavin-containing] A
LigandBDBM50149893
Substrate/Competitorn/a
Meas. Tech.ChEMBL_802428 (CHEMBL1954871)
IC50 75700±n/a nM
Citation Chaurasiya, NDGanesan, SNanayakkara, NPDias, LRWalker, LATekwani, BL Inhibition of human monoamine oxidase A and B by 5-phenoxy 8-aminoquinoline analogs. Bioorg Med Chem Lett22:1701-4 (2012) 
 
Amine oxidase [flavin-containing] A
Name:Amine oxidase [flavin-containing] A
Type:Protein
Mol. Mass.:59689.53
Organism:Homo sapiens (Human)
Description:P21397
Residue:527
BDBM50149893
NameBDBM50149893
Synonyms:4-(6-Methoxy-quinolin-8-ylamino)-pentyl-ammonium PRIMAQUINE
TypeSmall organic molecule
Emp. Form.C15H22N3O
Mol. Mass.260.3541
SMILESCOc1cc(NC(C)CCC[NH3+])c2ncccc2c1