Reaction Details
TargetAmine oxidase [flavin-containing] B
LigandBDBM50149893
Substrate/Competitorn/a
Meas. Tech.ChEMBL_802429 (CHEMBL1954872)
IC50 94500±n/a nM
Citation Chaurasiya, NDGanesan, SNanayakkara, NPDias, LRWalker, LATekwani, BL Inhibition of human monoamine oxidase A and B by 5-phenoxy 8-aminoquinoline analogs. Bioorg Med Chem Lett22:1701-4 (2012) 
 
Amine oxidase [flavin-containing] B
Name:Amine oxidase [flavin-containing] B
Type:Protein
Mol. Mass.:58768.76
Organism:Homo sapiens (Human)
Description:P27338
Residue:520
BDBM50149893
NameBDBM50149893
Synonyms:4-(6-Methoxy-quinolin-8-ylamino)-pentyl-ammonium PRIMAQUINE
TypeSmall organic molecule
Emp. Form.C15H22N3O
Mol. Mass.260.3541
SMILESCOc1cc(NC(C)CCC[NH3+])c2ncccc2c1