Reaction Details
TargetBaculoviral IAP repeat-containing protein 2
LigandBDBM50364493
Substrate/Competitorn/a
Meas. Tech.ChEMBL_802615 (CHEMBL1952922)
IC50 30±n/a nM
Citation Hennessy, EJSaeh, JCSha, LMacIntyre, TWang, HLarsen, NAAquila, BMFerguson, ADLaing, NMOmer, CA Discovery of aminopiperidine-based Smac mimetics as IAP antagonists. Bioorg Med Chem Lett22:1690-4 (2012) 
 
Baculoviral IAP repeat-containing protein 2
Name:Baculoviral IAP repeat-containing protein 2
Type:Protein
Mol. Mass.:69900.47
Organism:Homo sapiens (Human)
Description:Q13490
Residue:618
BDBM50364493
NameBDBM50364493
Synonyms:CHEMBL1950857
TypeSmall organic molecule
Emp. Form.C24H40N4O2
Mol. Mass.416.6
SMILESCN[C@@H](C)C(=O)N[C@H](C(=O)N[C@H]1CCCN(CCc2ccc(C)cc2)C1)C(C)(C)C