Reaction Details
TargetCytochrome P450 3A4
LigandBDBM50364652
Substrate/Competitorn/a
Meas. Tech.ChEMBL_802673 (CHEMBL1953081)
IC50 26000±n/a nM
Citation Song, XLi, XRuiz, CHYin, YFeng, YKamenecka, TMCameron, MD Imidazopyridines as selective CYP3A4 inhibitors. Bioorg Med Chem Lett22:1611-4 (2012) 
 
Cytochrome P450 3A4
Name:Cytochrome P450 3A4
Type:Enzyme
Mol. Mass.:57349.57
Organism:Homo sapiens (Human)
Description:n/a
Residue:503
BDBM50364652
NameBDBM50364652
Synonyms:CHEMBL1951350
TypeSmall organic molecule
Emp. Form.C24H25N7O3
Mol. Mass.459.5004
SMILESCCn1c2c(ncnc2[nH]c1=O)-c1ccc(NC(=O)Nc2cccc(c2)C(=O)NC(C)C)cc1