Reaction Details
TargetCytochrome P450 3A4
LigandBDBM50364653
Substrate/Competitorn/a
Meas. Tech.ChEMBL_802673 (CHEMBL1953081)
IC50 130±n/a nM
Citation Song, XLi, XRuiz, CHYin, YFeng, YKamenecka, TMCameron, MD Imidazopyridines as selective CYP3A4 inhibitors. Bioorg Med Chem Lett22:1611-4 (2012) 
 
Cytochrome P450 3A4
Name:Cytochrome P450 3A4
Type:Enzyme
Mol. Mass.:57349.57
Organism:Homo sapiens (Human)
Description:n/a
Residue:503
BDBM50364653
NameBDBM50364653
Synonyms:CHEMBL1951443
TypeSmall organic molecule
Emp. Form.C22H22N4O2
Mol. Mass.374.4357
SMILESCC(C)NC(=O)c1cccc(NC(=O)Nc2ccc(cc2)-c2ccncc2)c1