Reaction Details
TargetCytochrome P450 3A5
LigandBDBM50364628
Substrate/Competitorn/a
Meas. Tech.ChEMBL_802674 (CHEMBL1953082)
IC50 11400±n/a nM
Citation Song, XLi, XRuiz, CHYin, YFeng, YKamenecka, TMCameron, MD Imidazopyridines as selective CYP3A4 inhibitors. Bioorg Med Chem Lett22:1611-4 (2012) 
 
Cytochrome P450 3A5
Name:Cytochrome P450 3A5
Type:Protein
Mol. Mass.:57118.00
Organism:Homo sapiens (Human)
Description:P20815
Residue:502
BDBM50364628
NameBDBM50364628
Synonyms:CHEMBL1951323
TypeSmall organic molecule
Emp. Form.C19H14FN5O
Mol. Mass.347.3458
SMILESFc1cccc(NC(=O)Nc2ccc(cc2)-c2ccnc3nc[nH]c23)c1