Reaction Details
TargetCytochrome P450 2C19
LigandBDBM50364777
Substrate/Competitorn/a
Meas. Tech.ChEMBL_803272 (CHEMBL1955097)
IC50 4000±n/a nM
Citation Pastor, JOyarzabal, JSaluste, GAlvarez, RMRivero, VRamos, FCendón, EBlanco-Aparicio, CAjenjo, NCebriá, AAlbarrán, MICebrián, DCorrionero, AFominaya, JMontoya, GMazzorana, M Hit to lead evaluation of 1,2,3-triazolo[4,5-b]pyridines as PIM kinase inhibitors. Bioorg Med Chem Lett22:1591-7 (2012) 
 
Cytochrome P450 2C19
Name:Cytochrome P450 2C19
Type:Enzyme
Mol. Mass.:55935.47
Organism:Homo sapiens (Human)
Description:P33261
Residue:490
BDBM50364777
NameBDBM50364777
Synonyms:CHEMBL1952142
TypeSmall organic molecule
Emp. Form.C19H21F3N6O2
Mol. Mass.422.4042
SMILESCOc1cc(NCC2CCNCC2)nc2n(nnc12)-c1cccc(OC(F)(F)F)c1