Reaction Details
TargetSerine/threonine-protein kinase pim-1
LigandBDBM50364777
Substrate/Competitorn/a
Meas. Tech.ChEMBL_803130 (CHEMBL1954566)
IC50 1±n/a nM
Citation Pastor, JOyarzabal, JSaluste, GAlvarez, RMRivero, VRamos, FCendón, EBlanco-Aparicio, CAjenjo, NCebriá, AAlbarrán, MICebrián, DCorrionero, AFominaya, JMontoya, GMazzorana, M Hit to lead evaluation of 1,2,3-triazolo[4,5-b]pyridines as PIM kinase inhibitors. Bioorg Med Chem Lett22:1591-7 (2012) 
 
Serine/threonine-protein kinase pim-1
Name:Serine/threonine-protein kinase pim-1
Type:Protein
Mol. Mass.:35681.82
Organism:Homo sapiens (Human)
Description:P11309
Residue:313
BDBM50364777
NameBDBM50364777
Synonyms:CHEMBL1952142
TypeSmall organic molecule
Emp. Form.C19H21F3N6O2
Mol. Mass.422.4042
SMILESCOc1cc(NCC2CCNCC2)nc2n(nnc12)-c1cccc(OC(F)(F)F)c1