Reaction Details
TargetSerine/threonine-protein kinase pim-3
LigandBDBM50364778
Substrate/Competitorn/a
Meas. Tech.ChEMBL_803132 (CHEMBL1954568)
IC50 2.5±n/a nM
Citation Pastor, JOyarzabal, JSaluste, GAlvarez, RMRivero, VRamos, FCendón, EBlanco-Aparicio, CAjenjo, NCebriá, AAlbarrán, MICebrián, DCorrionero, AFominaya, JMontoya, GMazzorana, M Hit to lead evaluation of 1,2,3-triazolo[4,5-b]pyridines as PIM kinase inhibitors. Bioorg Med Chem Lett22:1591-7 (2012) 
 
Serine/threonine-protein kinase pim-3
Name:Serine/threonine-protein kinase pim-3
Type:Protein
Mol. Mass.:35888.19
Organism:Homo sapiens (Human)
Description:Q86V86
Residue:326
BDBM50364778
NameBDBM50364778
Synonyms:CHEMBL1952143
TypeSmall organic molecule
Emp. Form.C20H27N7O
Mol. Mass.381.4747
SMILESCOc1cc(NCC2CCNCC2)nc2n(nnc12)-c1cccc(c1)N(C)C