Reaction Details
TargetCannabinoid receptor 1
LigandBDBM50364927
Substrate/Competitorn/a
Meas. Tech.ChEMBL_804069 (CHEMBL1952464)
Ki 264±n/a nM
Citation Cheng, YXPourashraf, MLuo, XSrivastava, SWalpole, CSalois, DSt-Onge, SPayza, KLessard, EYu, XHTomaszewski, MJ ¿-Carbolines: a novel class of cannabinoid agonists with high aqueous solubility and restricted CNS penetration. Bioorg Med Chem Lett22:1619-24 (2012) 
 
Cannabinoid receptor 1
Name:Cannabinoid receptor 1
Type:G Protein-Coupled Receptor (GPCR)
Mol. Mass.:52868.96
Organism:Homo sapiens (Human)
Description:P21554
Residue:472
BDBM50364927
NameBDBM50364927
Synonyms:CHEMBL1950342
TypeSmall organic molecule
Emp. Form.C23H31N3O
Mol. Mass.365.5117
SMILESCC1CCN(CC1)C(=O)c1ccc2[nH]c3CCN(Cc3c2c1)C1CCCC1