Reaction Details
TargetCannabinoid receptor 1
LigandBDBM50364937
Substrate/Competitorn/a
Meas. Tech.ChEMBL_804070 (CHEMBL1952635)
EC50 59±n/a nM
Citation Cheng, YXPourashraf, MLuo, XSrivastava, SWalpole, CSalois, DSt-Onge, SPayza, KLessard, EYu, XHTomaszewski, MJ ¿-Carbolines: a novel class of cannabinoid agonists with high aqueous solubility and restricted CNS penetration. Bioorg Med Chem Lett22:1619-24 (2012) 
 
Cannabinoid receptor 1
Name:Cannabinoid receptor 1
Type:G Protein-Coupled Receptor (GPCR)
Mol. Mass.:52868.96
Organism:Homo sapiens (Human)
Description:P21554
Residue:472
BDBM50364937
NameBDBM50364937
Synonyms:CHEMBL1950353
TypeSmall organic molecule
Emp. Form.C29H35N3O4S
Mol. Mass.521.671
SMILESCC1CCN(CC1)C(=O)c1ccc2n(c3CCN(Cc3c2c1)C1CCOCC1)S(=O)(=O)c1ccccc1