Reaction Details
TargetCannabinoid receptor 1
LigandBDBM50364936
Substrate/Competitorn/a
Meas. Tech.ChEMBL_804069 (CHEMBL1952464)
Ki 170±n/a nM
Citation Cheng, YXPourashraf, MLuo, XSrivastava, SWalpole, CSalois, DSt-Onge, SPayza, KLessard, EYu, XHTomaszewski, MJ ¿-Carbolines: a novel class of cannabinoid agonists with high aqueous solubility and restricted CNS penetration. Bioorg Med Chem Lett22:1619-24 (2012) 
 
Cannabinoid receptor 1
Name:Cannabinoid receptor 1
Type:G Protein-Coupled Receptor (GPCR)
Mol. Mass.:52868.96
Organism:Homo sapiens (Human)
Description:P21554
Residue:472
BDBM50364936
NameBDBM50364936
Synonyms:CHEMBL1950352
TypeSmall organic molecule
Emp. Form.C26H37N3O4S
Mol. Mass.487.655
SMILESCC(C)S(=O)(=O)n1c2CCN(Cc2c2cc(ccc12)C(=O)N1CCC(C)CC1)C1CCOCC1