Reaction Details
TargetCannabinoid receptor 1
LigandBDBM50364948
Substrate/Competitorn/a
Meas. Tech.ChEMBL_804070 (CHEMBL1952635)
EC50 103±n/a nM
Citation Cheng, YXPourashraf, MLuo, XSrivastava, SWalpole, CSalois, DSt-Onge, SPayza, KLessard, EYu, XHTomaszewski, MJ ¿-Carbolines: a novel class of cannabinoid agonists with high aqueous solubility and restricted CNS penetration. Bioorg Med Chem Lett22:1619-24 (2012) 
 
Cannabinoid receptor 1
Name:Cannabinoid receptor 1
Type:G Protein-Coupled Receptor (GPCR)
Mol. Mass.:52868.96
Organism:Homo sapiens (Human)
Description:P21554
Residue:472
BDBM50364948
NameBDBM50364948
Synonyms:CHEMBL1950331
TypeSmall organic molecule
Emp. Form.C28H33N3O
Mol. Mass.427.5811
SMILESCC1CCN(CC1)C(=O)c1ccc2n(CC=C)c3CCN(Cc4ccccc4)Cc3c2c1