Reaction Details
TargetCoagulation factor X
LigandBDBM50365116
Substrate/Competitorn/a
Meas. Tech.ChEMBL_802703 (CHEMBL1953229)
Ki 2830±n/a nM
Citation Ilic, MKikelj, DIlaš, J Fluorinated dual antithrombotic compounds based on 1,4-benzoxazine scaffold. Eur J Med Chem50:255-63 (2012) 
 
Coagulation factor X
Name:Coagulation factor X
Type:Enzyme
Mol. Mass.:54726.60
Organism:Homo sapiens (Human)
Description:n/a
Residue:488
BDBM50365116
NameBDBM50365116
Synonyms:CHEMBL1952401
TypeSmall organic molecule
Emp. Form.C29H31FN4O5
Mol. Mass.534.5786
SMILESCCOC(=O)C(=O)N(Cc1ccc(F)cc1)c1ccc2N(C)CC(C)(COc3ccc(cc3)C(N)=N)Oc2c1