Reaction Details
TargetCoagulation factor X
LigandBDBM50365117
Substrate/Competitorn/a
Meas. Tech.ChEMBL_802703 (CHEMBL1953229)
Ki 7700±n/a nM
Citation Ilic, MKikelj, DIlaš, J Fluorinated dual antithrombotic compounds based on 1,4-benzoxazine scaffold. Eur J Med Chem50:255-63 (2012) 
 
Coagulation factor X
Name:Coagulation factor X
Type:Enzyme
Mol. Mass.:54726.60
Organism:Homo sapiens (Human)
Description:n/a
Residue:488
BDBM50365117
NameBDBM50365117
Synonyms:CHEMBL1952402
TypeSmall organic molecule
Emp. Form.C27H27FN4O5
Mol. Mass.506.5255
SMILESCN1CC(C)(COc2ccc(cc2)C(N)=N)Oc2cc(ccc12)N(Cc1ccc(F)cc1)C(=O)C(O)=O