Reaction Details
TargetCoagulation factor X
LigandBDBM50365119
Substrate/Competitorn/a
Meas. Tech.ChEMBL_802703 (CHEMBL1953229)
Ki 6600±n/a nM
Citation Ilic, MKikelj, DIlaš, J Fluorinated dual antithrombotic compounds based on 1,4-benzoxazine scaffold. Eur J Med Chem50:255-63 (2012) 
 
Coagulation factor X
Name:Coagulation factor X
Type:Enzyme
Mol. Mass.:54726.60
Organism:Homo sapiens (Human)
Description:n/a
Residue:488
BDBM50365119
NameBDBM50365119
Synonyms:CHEMBL1949701
TypeSmall organic molecule
Emp. Form.C27H29FN4O4
Mol. Mass.492.542
SMILESCN1CC(C)(COc2ccc(cc2)C(N)=N)Oc2cc(ccc12)N(CC(O)=O)Cc1cccc(F)c1