Reaction Details
TargetCoagulation factor X
LigandBDBM50349609
Substrate/Competitorn/a
Meas. Tech.ChEMBL_802703 (CHEMBL1953229)
Ki 8000±n/a nM
Citation Ilic, MKikelj, DIlaš, J Fluorinated dual antithrombotic compounds based on 1,4-benzoxazine scaffold. Eur J Med Chem50:255-63 (2012) 
 
Coagulation factor X
Name:Coagulation factor X
Type:Enzyme
Mol. Mass.:54726.60
Organism:Homo sapiens (Human)
Description:n/a
Residue:488
BDBM50349609
NameBDBM50349609
Synonyms:CHEMBL1808949
TypeSmall organic molecule
Emp. Form.C29H32F2N4O4
Mol. Mass.538.5856
SMILESCCOC(=O)CN(Cc1ccc(F)c(F)c1)c1ccc2OC(C)(COc3ccc(cc3)C(N)=N)CN(C)c2c1