Reaction Details
TargetCoagulation factor X
LigandBDBM50365128
Substrate/Competitorn/a
Meas. Tech.ChEMBL_802703 (CHEMBL1953229)
Ki 9800±n/a nM
Citation Ilic, MKikelj, DIlaš, J Fluorinated dual antithrombotic compounds based on 1,4-benzoxazine scaffold. Eur J Med Chem50:255-63 (2012) 
 
Coagulation factor X
Name:Coagulation factor X
Type:Enzyme
Mol. Mass.:54726.60
Organism:Homo sapiens (Human)
Description:n/a
Residue:488
BDBM50365128
NameBDBM50365128
Synonyms:CHEMBL1949835 | CHEMBL2216906
TypeSmall organic molecule
Emp. Form.C27H28F2N4O4
Mol. Mass.510.5324
SMILESCN1CC(C)(COc2ccc(cc2)C(N)=N)Oc2ccc(cc12)N(CC(O)=O)Cc1cc(F)cc(F)c1