Reaction Details
TargetCoagulation factor X
LigandBDBM50365132
Substrate/Competitorn/a
Meas. Tech.ChEMBL_802703 (CHEMBL1953229)
Ki 1600±n/a nM
Citation Ilic, MKikelj, DIlaš, J Fluorinated dual antithrombotic compounds based on 1,4-benzoxazine scaffold. Eur J Med Chem50:255-63 (2012) 
 
Coagulation factor X
Name:Coagulation factor X
Type:Enzyme
Mol. Mass.:54726.60
Organism:Homo sapiens (Human)
Description:n/a
Residue:488
BDBM50365132
NameBDBM50365132
Synonyms:CHEMBL1949839
TypeSmall organic molecule
Emp. Form.C27H26F2N4O5
Mol. Mass.524.5159
SMILESCN1CC(C)(COc2ccc(cc2)C(N)=N)Oc2cc(ccc12)N(Cc1cc(F)cc(F)c1)C(=O)C(O)=O