Reaction Details
TargetIntegrin alpha-IIb/beta-3
LigandBDBM50253780
Substrate/Competitorn/a
Meas. Tech.ChEMBL_802704 (CHEMBL1953230)
IC50 28000±n/a nM
Citation Ilic, MKikelj, DIlaš, J Fluorinated dual antithrombotic compounds based on 1,4-benzoxazine scaffold. Eur J Med Chem50:255-63 (2012) 
 
Integrin alpha-IIb/beta-3
Name:Integrin alpha-IIb/beta-3
Synonyms:Glycoprotein IIb/IIIa
Type:n/a
Mol. Mass.:n/a
Description:ASSAY_ID of EBI is 30109
Components:This complex has 2 components.
Component 1
Name:Integrin beta-3
Type:Protein
Mol. Mass.:87038.91
Organism:Homo sapiens (Human)
Description:P05106
Residue:788
Component 2
Name:Integrin alpha-IIb
Synonyms:CD_antigen=CD41 GPIIb Glycoprotein IIb ITGA2B Integrin alpha-IIb heavy chain Integrin alpha-IIb light chain, form 2 Integrin alpha-V/beta-3 and alpha-IIb/beta 3 | Platelet membrane glycoprotein IIb
Type:Protein
Mol. Mass.:113354.85
Organism:Homo sapiens (Human)
Description:P08514
Residue:1039
BDBM50253780
NameBDBM50253780
Synonyms:CHEMBL517875 | Ethyl 2-(benzyl{2-[(4-carbamimidoylphenoxy)methyl]-2,4-dimethyl-3,4-dihydro-2H-1,4-benzoxazin-7-yl}amino)acetate
TypeSmall organic molecule
Emp. Form.C29H34N4O4
Mol. Mass.502.6047
SMILESCCOC(=O)CN(Cc1ccccc1)c1ccc2N(C)CC(C)(COc3ccc(cc3)C(N)=N)Oc2c1