Reaction Details
TargetIntegrin alpha-IIb/beta-3
LigandBDBM50365124
Substrate/Competitorn/a
Meas. Tech.ChEMBL_802704 (CHEMBL1953230)
IC50 80000±n/a nM
Citation Ilic, MKikelj, DIlaš, J Fluorinated dual antithrombotic compounds based on 1,4-benzoxazine scaffold. Eur J Med Chem50:255-63 (2012) 
 
Integrin alpha-IIb/beta-3
Name:Integrin alpha-IIb/beta-3
Synonyms:Glycoprotein IIb/IIIa
Type:n/a
Mol. Mass.:n/a
Description:ASSAY_ID of EBI is 30109
Components:This complex has 2 components.
Component 1
Name:Integrin beta-3
Type:Protein
Mol. Mass.:87038.91
Organism:Homo sapiens (Human)
Description:P05106
Residue:788
Component 2
Name:Integrin alpha-IIb
Synonyms:CD_antigen=CD41 GPIIb Glycoprotein IIb ITGA2B Integrin alpha-IIb heavy chain Integrin alpha-IIb light chain, form 2 Integrin alpha-V/beta-3 and alpha-IIb/beta 3 | Platelet membrane glycoprotein IIb
Type:Protein
Mol. Mass.:113354.85
Organism:Homo sapiens (Human)
Description:P08514
Residue:1039
BDBM50365124
NameBDBM50365124
Synonyms:CHEMBL1952408
TypeSmall organic molecule
Emp. Form.C27H28F2N4O4
Mol. Mass.510.5324
SMILESCN1CC(C)(COc2ccc(cc2)C(N)=N)Oc2cc(ccc12)N(CC(O)=O)Cc1ccc(F)c(F)c1