Reaction Details
TargetProthrombin
LigandBDBM50253816
Substrate/Competitorn/a
Meas. Tech.ChEMBL_802701 (CHEMBL1953227)
Ki 740±n/a nM
Citation Ilic, MKikelj, DIlaš, J Fluorinated dual antithrombotic compounds based on 1,4-benzoxazine scaffold. Eur J Med Chem50:255-63 (2012) 
 
Prothrombin
Name:Prothrombin
Type:Protein
Mol. Mass.:70029.57
Organism:Homo sapiens (Human)
Description:P00734
Residue:622
BDBM50253816
NameBDBM50253816
Synonyms:CHEMBL460143 | Ethyl 2-(benzyl{2-[(4-carbamimidoylphenoxy)methyl]-2,4-dimethyl-3,4-dihydro-2H-1,4-benzoxazin-6-yl}amino)acetate
TypeSmall organic molecule
Emp. Form.C29H34N4O4
Mol. Mass.502.6047
SMILESCCOC(=O)CN(Cc1ccccc1)c1ccc2OC(C)(COc3ccc(cc3)C(N)=N)CN(C)c2c1