Reaction Details
TargetProthrombin
LigandBDBM50349612
Substrate/Competitorn/a
Meas. Tech.ChEMBL_802701 (CHEMBL1953227)
Ki 330±n/a nM
Citation Ilic, MKikelj, DIlaš, J Fluorinated dual antithrombotic compounds based on 1,4-benzoxazine scaffold. Eur J Med Chem50:255-63 (2012) 
 
Prothrombin
Name:Prothrombin
Type:Protein
Mol. Mass.:70029.57
Organism:Homo sapiens (Human)
Description:P00734
Residue:622
BDBM50349612
NameBDBM50349612
Synonyms:CHEMBL1808952
TypeSmall organic molecule
Emp. Form.C29H31FN4O5
Mol. Mass.534.5786
SMILESCCOC(=O)C(=O)N(Cc1ccc(F)cc1)c1ccc2OC(C)(COc3ccc(cc3)C(N)=N)CN(C)c2c1