Reaction Details
TargetProthrombin
LigandBDBM50365117
Substrate/Competitorn/a
Meas. Tech.ChEMBL_802701 (CHEMBL1953227)
Ki 260±n/a nM
Citation Ilic, MKikelj, DIlaš, J Fluorinated dual antithrombotic compounds based on 1,4-benzoxazine scaffold. Eur J Med Chem50:255-63 (2012) 
 
Prothrombin
Name:Prothrombin
Type:Protein
Mol. Mass.:70029.57
Organism:Homo sapiens (Human)
Description:P00734
Residue:622
BDBM50365117
NameBDBM50365117
Synonyms:CHEMBL1952402
TypeSmall organic molecule
Emp. Form.C27H27FN4O5
Mol. Mass.506.5255
SMILESCN1CC(C)(COc2ccc(cc2)C(N)=N)Oc2cc(ccc12)N(Cc1ccc(F)cc1)C(=O)C(O)=O