Reaction Details
TargetProthrombin
LigandBDBM50365124
Substrate/Competitorn/a
Meas. Tech.ChEMBL_802701 (CHEMBL1953227)
Ki 810±n/a nM
Citation Ilic, MKikelj, DIlaš, J Fluorinated dual antithrombotic compounds based on 1,4-benzoxazine scaffold. Eur J Med Chem50:255-63 (2012) 
 
Prothrombin
Name:Prothrombin
Type:Protein
Mol. Mass.:70029.57
Organism:Homo sapiens (Human)
Description:P00734
Residue:622
BDBM50365124
NameBDBM50365124
Synonyms:CHEMBL1952408
TypeSmall organic molecule
Emp. Form.C27H28F2N4O4
Mol. Mass.510.5324
SMILESCN1CC(C)(COc2ccc(cc2)C(N)=N)Oc2cc(ccc12)N(CC(O)=O)Cc1ccc(F)c(F)c1