Reaction Details
TargetProthrombin
LigandBDBM50365132
Substrate/Competitorn/a
Meas. Tech.ChEMBL_802701 (CHEMBL1953227)
Ki 150±n/a nM
Citation Ilic, MKikelj, DIlaš, J Fluorinated dual antithrombotic compounds based on 1,4-benzoxazine scaffold. Eur J Med Chem50:255-63 (2012) 
 
Prothrombin
Name:Prothrombin
Type:Protein
Mol. Mass.:70029.57
Organism:Homo sapiens (Human)
Description:P00734
Residue:622
BDBM50365132
NameBDBM50365132
Synonyms:CHEMBL1949839
TypeSmall organic molecule
Emp. Form.C27H26F2N4O5
Mol. Mass.524.5159
SMILESCN1CC(C)(COc2ccc(cc2)C(N)=N)Oc2cc(ccc12)N(Cc1cc(F)cc(F)c1)C(=O)C(O)=O