Reaction Details
TargetCoagulation factor X
LigandBDBM50253818
Substrate/Competitorn/a
Meas. Tech.ChEMBL_802703 (CHEMBL1953229)
Ki 17000±n/a nM
Citation Ilic, MKikelj, DIlaš, J Fluorinated dual antithrombotic compounds based on 1,4-benzoxazine scaffold. Eur J Med Chem50:255-63 (2012) 
 
Coagulation factor X
Name:Coagulation factor X
Type:Enzyme
Mol. Mass.:54726.60
Organism:Homo sapiens (Human)
Description:n/a
Residue:488
BDBM50253818
NameBDBM50253818
Synonyms:2-(Benzyl{2-[(4-carbamimidoylphenoxy)methyl]-2,4-dimethyl-3,4-dihydro-2H-1,4-benzoxazin-7-yl}amino)-2-oxoacetic Acid | CHEMBL460355
TypeSmall organic molecule
Emp. Form.C27H28N4O5
Mol. Mass.488.535
SMILESCN1CC(C)(COc2ccc(cc2)C(N)=N)Oc2cc(ccc12)N(Cc1ccccc1)C(=O)C(O)=O