Reaction Details
TargetIntegrin alpha-V/beta-3
LigandBDBM50253780
Substrate/Competitorn/a
Meas. Tech.ChEMBL_802705 (CHEMBL1953231)
IC50>100000±n/a nM
Citation Ilic, MKikelj, DIlaš, J Fluorinated dual antithrombotic compounds based on 1,4-benzoxazine scaffold. Eur J Med Chem50:255-63 (2012) 
 
Integrin alpha-V/beta-3
Name:Integrin alpha-V/beta-3
Type:Enzyme
Mol. Mass.:n/a
Description:n/a
Components:This complex has 2 components.
Component 1
Name:Integrin alpha-V
Synonyms:ITAV_HUMAN Integrin alpha-V/alpha-5 VNRA Vitronectin receptor | Vitronectin receptor subunit alpha
Type:PROTEIN
Mol. Mass.:116024.92
Organism:Homo sapiens (Human)
Description:ChEMBL_582336
Residue:1048
Component 2
Name:Integrin beta-3
Synonyms:CD_antigen=CD61 GPIIIa ITGB3 Platelet membrane glycoprotein IIIa
Type:Protein
Mol. Mass.:87038.91
Organism:Homo sapiens (Human)
Description:P05106
Residue:788
BDBM50253780
NameBDBM50253780
Synonyms:CHEMBL517875 | Ethyl 2-(benzyl{2-[(4-carbamimidoylphenoxy)methyl]-2,4-dimethyl-3,4-dihydro-2H-1,4-benzoxazin-7-yl}amino)acetate
TypeSmall organic molecule
Emp. Form.C29H34N4O4
Mol. Mass.502.6047
SMILESCCOC(=O)CN(Cc1ccccc1)c1ccc2N(C)CC(C)(COc3ccc(cc3)C(N)=N)Oc2c1