Reaction Details
TargetIntegrin alpha-V/beta-3
LigandBDBM50349615
Substrate/Competitorn/a
Meas. Tech.ChEMBL_802705 (CHEMBL1953231)
IC50>100000±n/a nM
Citation Ilic, MKikelj, DIlaš, J Fluorinated dual antithrombotic compounds based on 1,4-benzoxazine scaffold. Eur J Med Chem50:255-63 (2012) 
 
Integrin alpha-V/beta-3
Name:Integrin alpha-V/beta-3
Type:Enzyme
Mol. Mass.:n/a
Description:n/a
Components:This complex has 2 components.
Component 1
Name:Integrin alpha-V
Synonyms:ITAV_HUMAN Integrin alpha-V/alpha-5 VNRA Vitronectin receptor | Vitronectin receptor subunit alpha
Type:PROTEIN
Mol. Mass.:116024.92
Organism:Homo sapiens (Human)
Description:ChEMBL_582336
Residue:1048
Component 2
Name:Integrin beta-3
Synonyms:CD_antigen=CD61 GPIIIa ITGB3 Platelet membrane glycoprotein IIIa
Type:Protein
Mol. Mass.:87038.91
Organism:Homo sapiens (Human)
Description:P05106
Residue:788
BDBM50349615
NameBDBM50349615
Synonyms:CHEMBL1808955
TypeSmall organic molecule
Emp. Form.C29H33FN4O4
Mol. Mass.520.5951
SMILESCCOC(=O)CN(Cc1cccc(F)c1)c1ccc2N(C)CC(C)(COc3ccc(cc3)C(N)=N)Oc2c1