Reaction Details
TargetIntegrin alpha-V/beta-3
LigandBDBM50365126
Substrate/Competitorn/a
Meas. Tech.ChEMBL_802705 (CHEMBL1953231)
IC50>100000±n/a nM
Citation Ilic, MKikelj, DIlaš, J Fluorinated dual antithrombotic compounds based on 1,4-benzoxazine scaffold. Eur J Med Chem50:255-63 (2012) 
 
Integrin alpha-V/beta-3
Name:Integrin alpha-V/beta-3
Type:Enzyme
Mol. Mass.:n/a
Description:n/a
Components:This complex has 2 components.
Component 1
Name:Integrin alpha-V
Synonyms:ITAV_HUMAN Integrin alpha-V/alpha-5 VNRA Vitronectin receptor | Vitronectin receptor subunit alpha
Type:PROTEIN
Mol. Mass.:116024.92
Organism:Homo sapiens (Human)
Description:ChEMBL_582336
Residue:1048
Component 2
Name:Integrin beta-3
Synonyms:CD_antigen=CD61 GPIIIa ITGB3 Platelet membrane glycoprotein IIIa
Type:Protein
Mol. Mass.:87038.91
Organism:Homo sapiens (Human)
Description:P05106
Residue:788
BDBM50365126
NameBDBM50365126
Synonyms:CHEMBL1952410
TypeSmall organic molecule
Emp. Form.C29H30F2N4O5
Mol. Mass.552.5691
SMILESCCOC(=O)C(=O)N(Cc1ccc(F)c(F)c1)c1ccc2N(C)CC(C)(COc3ccc(cc3)C(N)=N)Oc2c1