Reaction Details
TargetPoly [ADP-ribose] polymerase 1
LigandBDBM50365137
Substrate/Competitorn/a
Meas. Tech.ChEMBL_802708 (CHEMBL1953234)
IC50 9010±n/a nM
Citation Kulkarni, SSSingh, SShah, JRLow, WKTalele, TT Synthesis and SAR optimization of quinazolin-4(3H)-ones as poly(ADP-ribose)polymerase-1 inhibitors. Eur J Med Chem50:264-73 (2012) 
 
Poly [ADP-ribose] polymerase 1
Name:Poly [ADP-ribose] polymerase 1
Type:n/a
Mol. Mass.:113114.22
Organism:Homo sapiens (Human)
Description:P09874
Residue:1014
BDBM50365137
NameBDBM50365137
Synonyms:CHEMBL1949843
TypeSmall organic molecule
Emp. Form.C8H5FN2O
Mol. Mass.164.1365
SMILESFc1ccc2nc[nH]c(=O)c2c1