Reaction Details
TargetPoly [ADP-ribose] polymerase 1
LigandBDBM50365144
Substrate/Competitorn/a
Meas. Tech.ChEMBL_802708 (CHEMBL1953234)
IC50 7500±n/a nM
Citation Kulkarni, SSSingh, SShah, JRLow, WKTalele, TT Synthesis and SAR optimization of quinazolin-4(3H)-ones as poly(ADP-ribose)polymerase-1 inhibitors. Eur J Med Chem50:264-73 (2012) 
 
Poly [ADP-ribose] polymerase 1
Name:Poly [ADP-ribose] polymerase 1
Type:n/a
Mol. Mass.:113114.22
Organism:Homo sapiens (Human)
Description:P09874
Residue:1014
BDBM50365144
NameBDBM50365144
Synonyms:CHEMBL1949850
TypeSmall organic molecule
Emp. Form.C9H5F3N2O
Mol. Mass.214.144
SMILESFC(F)(F)c1ccc2c(c1)nc[nH]c2=O