Reaction Details
TargetPoly [ADP-ribose] polymerase 1
LigandBDBM50241202
Substrate/Competitorn/a
Meas. Tech.ChEMBL_802708 (CHEMBL1953234)
IC50 1210±n/a nM
Citation Kulkarni, SSSingh, SShah, JRLow, WKTalele, TT Synthesis and SAR optimization of quinazolin-4(3H)-ones as poly(ADP-ribose)polymerase-1 inhibitors. Eur J Med Chem50:264-73 (2012) 
 
Poly [ADP-ribose] polymerase 1
Name:Poly [ADP-ribose] polymerase 1
Type:n/a
Mol. Mass.:113114.22
Organism:Homo sapiens (Human)
Description:P09874
Residue:1014
BDBM50241202
NameBDBM50241202
Synonyms:2-Methyl-3H-quinazolin-4-one | CHEMBL395092
TypeSmall organic molecule
Emp. Form.C9H8N2O
Mol. Mass.160.1726
SMILESCc1nc2ccccc2c(=O)[nH]1