Reaction Details
TargetPoly [ADP-ribose] polymerase 1
LigandBDBM27712
Substrate/Competitorn/a
Meas. Tech.ChEMBL_802708 (CHEMBL1953234)
IC50 1180±n/a nM
Citation Kulkarni, SSSingh, SShah, JRLow, WKTalele, TT Synthesis and SAR optimization of quinazolin-4(3H)-ones as poly(ADP-ribose)polymerase-1 inhibitors. Eur J Med Chem50:264-73 (2012) 
 
Poly [ADP-ribose] polymerase 1
Name:Poly [ADP-ribose] polymerase 1
Type:n/a
Mol. Mass.:113114.22
Organism:Homo sapiens (Human)
Description:P09874
Residue:1014
BDBM27712
NameBDBM27712
Synonyms:5-chloro-2-methyl-3,4-dihydroquinazolin-4-one quinazolinone analogue, 18
TypeSmall organic molecule
Emp. Form.C9H7ClN2O
Mol. Mass.194.618
SMILESCc1nc2cccc(Cl)c2c(=O)[nH]1