Reaction Details
TargetProstaglandin G/H synthase 2
LigandBDBM50365168
Substrate/Competitorn/a
Meas. Tech.ChEMBL_805485 (CHEMBL1955378)
IC50 19±n/a nM
Citation Hayashi, SUeno, NMurase, ANakagawa, YTakada, J Novel acid-type cyclooxygenase-2 inhibitors: Design, synthesis, and structure-activity relationship for anti-inflammatory drug. Eur J Med Chem50:179-95 (2012) 
 
Prostaglandin G/H synthase 2
Name:Prostaglandin G/H synthase 2
Type:Enzyme
Mol. Mass.:69003.89
Organism:Homo sapiens (Human)
Description:Recombinant Cox-2 provided by Cayman (Cayman Chemical Co.,Ann Arbor, MI).
Residue:604
BDBM50365168
NameBDBM50365168
Synonyms:CHEMBL1950020
TypeSmall organic molecule
Emp. Form.C20H17ClN2O3
Mol. Mass.368.814
SMILESOC(=O)Cc1c([nH]c2cc(Cl)ccc12)C(=O)c1cc2CCCCc2cn1