Reaction Details
TargetProstaglandin G/H synthase 2
LigandBDBM50365165
Substrate/Competitorn/a
Meas. Tech.ChEMBL_805488 (CHEMBL1955381)
IC50 150±n/a nM
Citation Hayashi, SUeno, NMurase, ANakagawa, YTakada, J Novel acid-type cyclooxygenase-2 inhibitors: Design, synthesis, and structure-activity relationship for anti-inflammatory drug. Eur J Med Chem50:179-95 (2012) 
 
Prostaglandin G/H synthase 2
Name:Prostaglandin G/H synthase 2
Type:Enzyme
Mol. Mass.:69003.89
Organism:Homo sapiens (Human)
Description:Recombinant Cox-2 provided by Cayman (Cayman Chemical Co.,Ann Arbor, MI).
Residue:604
BDBM50365165
NameBDBM50365165
Synonyms:CHEMBL1950017
TypeSmall organic molecule
Emp. Form.C17H13FN2O3
Mol. Mass.312.2951
SMILESCc1ccnc(c1)C(=O)c1[nH]c2ccc(F)cc2c1CC(O)=O