Reaction Details
TargetPlatelet-derived growth factor receptor beta
LigandBDBM50365215
Substrate/Competitorn/a
Meas. Tech.ChEMBL_806393 (CHEMBL1959322)
IC50 2000±n/a nM
Citation Uings, IJSpacey, GDBonser, RW Effects of the indolocarbazole 3744W on the tyrosine kinase activity of the cytoplasmic domain of the platelet-derived growth factor beta-receptor. Cell Signal11:95-100 (1999) Platelet-derived growth factor receptor beta
Name:Platelet-derived growth factor receptor beta
Type:Enzyme
Mol. Mass.:123922.25
Organism:Homo sapiens (Human)
Description:P09619
Residue:1106
BDBM50365215
NameBDBM50365215
Synonyms:CHEMBL1956068 | GSK screening, 36
TypeSmall organic molecule
Emp. Form.C22H15N3O4
Mol. Mass.385.3722
SMILESCOc1ccc2[nH]c3c4[nH]c5ccc(OC)cc5c4c4C(=O)NC(=O)c4c3c2c1