Reaction Details
Target5-hydroxytryptamine receptor 3A
LigandBDBM50365255
Substrate/Competitorn/a
Meas. Tech.ChEMBL_805903 (CHEMBL1960084)
Ki 11±n/a nM
Citation Tao, MAimone, LDHuang, ZMathiasen, JRaddatz, RLyons, JHudkins, RL Optimization of 5-pyridazin-3-one phenoxypropylamines as potent, selective histamine H3 receptor antagonists with potent cognition enhancing activity. J Med Chem55:414-23 (2012) 
 
5-hydroxytryptamine receptor 3A
Name:5-hydroxytryptamine receptor 3A
Type:Protein
Mol. Mass.:55283.27
Organism:Homo sapiens (Human)
Description:P46098
Residue:478
BDBM50365255
NameBDBM50365255
Synonyms:CHEMBL1958328
TypeSmall organic molecule
Emp. Form.C23H26N4O2
Mol. Mass.390.4781
SMILESC[C@H]1CCCN1CCCOc1ccc(cc1)-c1cnn(-c2ccccn2)c(=O)c1