Reaction Details
Target5-hydroxytryptamine receptor 3A
LigandBDBM50365250
Substrate/Competitorn/a
Meas. Tech.ChEMBL_805902 (CHEMBL1960083)
Ki 5.1±n/a nM
Citation Tao, MAimone, LDHuang, ZMathiasen, JRaddatz, RLyons, JHudkins, RL Optimization of 5-pyridazin-3-one phenoxypropylamines as potent, selective histamine H3 receptor antagonists with potent cognition enhancing activity. J Med Chem55:414-23 (2012) 
 
5-hydroxytryptamine receptor 3A
Name:5-hydroxytryptamine receptor 3A
Type:Enzyme Catalytic Domain
Mol. Mass.:55428.70
Organism:RAT
Description:5-HT3 HTR3A RAT::P35563
Residue:483
BDBM50365250
NameBDBM50365250
Synonyms:CHEMBL1958323
TypeSmall organic molecule
Emp. Form.C19H25N3O2
Mol. Mass.327.4207
SMILESC[C@@H]1CCCN1CCCOc1ccc(cc1)-c1cc(=O)[nH]nc1C