Reaction Details
TargetBromodomain-containing protein 4
LigandBDBM50365265
Substrate/Competitorn/a
Meas. Tech.ChEMBL_806308 (CHEMBL1959072)
Kd 50±n/a nM
Citation Filippakopoulos, PPicaud, SFedorov, OKeller, MWrobel, MMorgenstern, OBracher, FKnapp, S Benzodiazepines and benzotriazepines as protein interaction inhibitors targeting bromodomains of the BET family. Bioorg Med Chem20:1878-86 (2012) 
 
Bromodomain-containing protein 4
Name:Bromodomain-containing protein 4
Type:Protein
Mol. Mass.:152264.84
Organism:Homo sapiens (Human)
Description:O60885
Residue:1362
BDBM50365265
NameBDBM50365265
Synonyms:CHEMBL1958347
TypeSmall organic molecule
Emp. Form.C22H22ClN5O2
Mol. Mass.423.895
SMILESCCNC(=O)C[C@@H]1N=C(c2ccc(Cl)cc2)c2ccc(OC)cc2-n2c(C)nnc12