Reaction Details
TargetProstaglandin G/H synthase 1
LigandBDBM22360
Substrate/Competitorn/a
Meas. Tech.ChEMBL_806309 (CHEMBL1959073)
IC50 300±n/a nM
Citation Jain, STran, SEl Gendy, MAKashfi, KJurasz, PVelázquez-Martínez, CA Nitric oxide release is not required to decrease the ulcerogenic profile of nonsteroidal anti-inflammatory drugs. J Med Chem55:688-96 (2012) 
 
Prostaglandin G/H synthase 1
Name:Prostaglandin G/H synthase 1
Type:Protein
Mol. Mass.:68868.60
Organism:Ovis aries (Sheep)
Description:n/a
Residue:600
BDBM22360
NameBDBM22360
Synonyms:2-(acetyloxy)benzoate Acetylsalicylic acid Endosprin Zorprin cid_2244
TypeAnti-Inflammatory Agents, Non-Steroidal
Emp. Form.C9H8O4
Mol. Mass.180.1574
SMILESCC(=O)Oc1ccccc1C(O)=O