Reaction Details
TargetProstaglandin G/H synthase 2
LigandBDBM50365268
Substrate/Competitorn/a
Meas. Tech.ChEMBL_806310 (CHEMBL1959074)
IC50 4600±n/a nM
Citation Jain, STran, SEl Gendy, MAKashfi, KJurasz, PVelázquez-Martínez, CA Nitric oxide release is not required to decrease the ulcerogenic profile of nonsteroidal anti-inflammatory drugs. J Med Chem55:688-96 (2012) 
 
Prostaglandin G/H synthase 2
Name:Prostaglandin G/H synthase 2
Type:Enzyme
Mol. Mass.:69003.89
Organism:Homo sapiens (Human)
Description:Recombinant Cox-2 provided by Cayman (Cayman Chemical Co.,Ann Arbor, MI).
Residue:604
BDBM50365268
NameBDBM50365268
Synonyms:CHEMBL1958350
TypeSmall organic molecule
Emp. Form.C27H24ClNO5
Mol. Mass.477.936
SMILESCOc1ccc2n(C(=O)c3ccc(Cl)cc3)c(C)c(CC(=O)Oc3ccc(CCO)cc3)c2c1