Reaction Details
TargetAdenosine receptor A2b
LigandBDBM50086170
Substrate/Competitorn/a
Meas. Tech.ChEMBL_806476 (CHEMBL1959515)
Ki 2±n/a nM
Citation Baraldi, PGBaraldi, SSaponaro, GPreti, DRomagnoli, RPiccagli, LCavalli, ARecanatini, MMoorman, ARZaid, ANVarani, KBorea, PATabrizi, MA Novel 1,3-dipropyl-8-(3-benzimidazol-2-yl-methoxy-1-methylpyrazol-5-yl)xanthines as potent and selective A2B adenosine receptor antagonists. J Med Chem55:797-811 (2012) 
 
Adenosine receptor A2b
Name:Adenosine receptor A2b
Type:G Protein-Coupled Receptor (GPCR)
Mol. Mass.:36341.22
Organism:Homo sapiens (Human)
Description:n/a
Residue:332
BDBM50086170
NameBDBM50086170
Synonyms:(4-Cyano-phenyl)-carbamic acid 4-(2,6-dioxo-1,3-dipropyl-2,3,6,7-tetrahydro-1H-purin-8-yl)-phenyl ester CHEMBL273807 N-(4-Cyano-phenyl)-2-[4-(2,6-dioxo-1,3-dipropyl-2,3,6,7-tetrahydro-1H-purin-8-yl)-phenoxy]-acetamide(MRS-1754) | N-(4-cyanophenyl)-2-(4-(2,6-dioxo-1,3-dipropyl-2,3,6,7-tetrahydro-1H-purin-8-yl)phenoxy)acetamide
TypeSmall organic molecule
Emp. Form.C26H26N6O4
Mol. Mass.486.5224
SMILESCCCn1c2nc([nH]c2c(=O)n(CCC)c1=O)-c1ccc(OCC(=O)Nc2ccc(cc2)C#N)cc1