Reaction Details
TargetAdenosine receptor A2b
LigandBDBM50365298
Substrate/Competitorn/a
Meas. Tech.ChEMBL_806468 (CHEMBL1959507)
Ki 12±n/a nM
Citation Baraldi, PGBaraldi, SSaponaro, GPreti, DRomagnoli, RPiccagli, LCavalli, ARecanatini, MMoorman, ARZaid, ANVarani, KBorea, PATabrizi, MA Novel 1,3-dipropyl-8-(3-benzimidazol-2-yl-methoxy-1-methylpyrazol-5-yl)xanthines as potent and selective A2B adenosine receptor antagonists. J Med Chem55:797-811 (2012) 
 
Adenosine receptor A2b
Name:Adenosine receptor A2b
Type:G Protein-Coupled Receptor (GPCR)
Mol. Mass.:36341.22
Organism:Homo sapiens (Human)
Description:n/a
Residue:332
BDBM50365298
NameBDBM50365298
Synonyms:CHEMBL1955904
TypeSmall organic molecule
Emp. Form.C26H30N8O5
Mol. Mass.534.567
SMILESCCCn1c2nc([nH]c2c(=O)n(CCC)c1=O)-c1cc(OCc2nc3ccc(cc3[nH]2)C(=O)OCC)nn1C