Reaction Details
TargetNitric oxide synthase, inducible
LigandBDBM106699
Substrate/Competitorn/a
Meas. Tech.ChEMBL_807636 (CHEMBL1960198)
IC50 58500±n/a nM
Citation Annedi, SCMaddaford, SPRamnauth, JRenton, PSpeed, JRakhit, SAndrews, JSPorreca, F 3,5-Disubstituted indole derivatives as selective human neuronal nitric oxide synthase (nNOS) inhibitors. Bioorg Med Chem Lett22:1980-4 (2012) 
 
Nitric oxide synthase, inducible
Name:Nitric oxide synthase, inducible
Type:Homodimer
Mol. Mass.:131141.95
Organism:Homo sapiens (Human)
Description:P35228
Residue:1153
BDBM106699
NameBDBM106699
Synonyms:CHEMBL1957350 | US8586620, 46
TypeSmall organic molecule
Emp. Form.C19H20N4O
Mol. Mass.320.3883
SMILESCN1CCC(=CC1)c1c[nH]c2ccc(cc12)N=C(N)c1ccco1