Reaction Details
TargetCytochrome P450 2C19
LigandBDBM106699
Substrate/Competitorn/a
Meas. Tech.ChEMBL_807642 (CHEMBL1960204)
IC50>100000±n/a nM
Citation Annedi, SCMaddaford, SPRamnauth, JRenton, PSpeed, JRakhit, SAndrews, JSPorreca, F 3,5-Disubstituted indole derivatives as selective human neuronal nitric oxide synthase (nNOS) inhibitors. Bioorg Med Chem Lett22:1980-4 (2012) 
 
Cytochrome P450 2C19
Name:Cytochrome P450 2C19
Type:Enzyme
Mol. Mass.:55935.47
Organism:Homo sapiens (Human)
Description:P33261
Residue:490
BDBM106699
NameBDBM106699
Synonyms:CHEMBL1957350 | US8586620, 46
TypeSmall organic molecule
Emp. Form.C19H20N4O
Mol. Mass.320.3883
SMILESCN1CCC(=CC1)c1c[nH]c2ccc(cc12)N=C(N)c1ccco1