Reaction Details
TargetCytochrome P450 3A4
LigandBDBM106699
Substrate/Competitorn/a
Meas. Tech.ChEMBL_807643 (CHEMBL1960205)
IC50>100000±n/a nM
Citation Annedi, SCMaddaford, SPRamnauth, JRenton, PSpeed, JRakhit, SAndrews, JSPorreca, F 3,5-Disubstituted indole derivatives as selective human neuronal nitric oxide synthase (nNOS) inhibitors. Bioorg Med Chem Lett22:1980-4 (2012) 
 
Cytochrome P450 3A4
Name:Cytochrome P450 3A4
Type:Enzyme
Mol. Mass.:57349.57
Organism:Homo sapiens (Human)
Description:n/a
Residue:503
BDBM106699
NameBDBM106699
Synonyms:CHEMBL1957350 | US8586620, 46
TypeSmall organic molecule
Emp. Form.C19H20N4O
Mol. Mass.320.3883
SMILESCN1CCC(=CC1)c1c[nH]c2ccc(cc12)N=C(N)c1ccco1