Reaction Details
TargetCytochrome P450 2D6
LigandBDBM106699
Substrate/Competitorn/a
Meas. Tech.ChEMBL_807645 (CHEMBL1960207)
IC50 20500±n/a nM
Citation Annedi, SCMaddaford, SPRamnauth, JRenton, PSpeed, JRakhit, SAndrews, JSPorreca, F 3,5-Disubstituted indole derivatives as selective human neuronal nitric oxide synthase (nNOS) inhibitors. Bioorg Med Chem Lett22:1980-4 (2012) 
 
Cytochrome P450 2D6
Name:Cytochrome P450 2D6
Type:Protein
Mol. Mass.:55774.82
Organism:Homo sapiens (Human)
Description:P10635
Residue:497
BDBM106699
NameBDBM106699
Synonyms:CHEMBL1957350 | US8586620, 46
TypeSmall organic molecule
Emp. Form.C19H20N4O
Mol. Mass.320.3883
SMILESCN1CCC(=CC1)c1c[nH]c2ccc(cc12)N=C(N)c1ccco1