Reaction Details
Target5-hydroxytryptamine receptor 2A
LigandBDBM50365595
Substrate/Competitorn/a
Meas. Tech.ChEMBL_808063 (CHEMBL1961171)
Ki 1.4±n/a nM
Citation Xiong, YUllman, BChoi, JSCherrier, MStrah-Pleynet, SDecaire, MFeichtinger, KFrazer, JMYoon, WHWhelan, KSanabria, EKGrottick, AJAl-Shamma, HSemple, G Identification of fused bicyclic heterocycles as potent and selective 5-HT(2A) receptor antagonists for the treatment of insomnia. Bioorg Med Chem Lett22:1870-3 (2012) 
 
5-hydroxytryptamine receptor 2A
Name:5-hydroxytryptamine receptor 2A
Type:undefined
Mol. Mass.:52607.65
Organism:Homo sapiens (Human)
Description:P28223
Residue:471
BDBM50365595
NameBDBM50365595
Synonyms:CHEMBL1957812
TypeSmall organic molecule
Emp. Form.C20H21F2N5O
Mol. Mass.385.4104
SMILESNc1cccc2nc(cn12)C(=O)N1CCN(CCc2ccc(F)cc2F)CC1