Reaction Details
TargetHistamine H3 receptor
LigandBDBM50365656
Substrate/Competitorn/a
Meas. Tech.ChEMBL_808214 (CHEMBL1961126)
Ki 4±n/a nM
Citation Shao, NAslanian, RWest, REWilliams, SMWu, RLHwa, JSondey, CLachowicz, JPalani, A Synthesis and structure-activity relationship (SAR) study of 4-azabenzoxazole analogues as H3 antagonists. Bioorg Med Chem Lett22:2075-8 (2012) 
 
Histamine H3 receptor
Name:Histamine H3 receptor
Type:G Protein-Coupled Receptor (GPCR)
Mol. Mass.:48691.47
Organism:Homo sapiens (Human)
Description:Binding assays were using CHO cells stably expressing hH3R receptors.
Residue:445
BDBM50365656
NameBDBM50365656
Synonyms:CHEMBL1958177
TypeSmall organic molecule
Emp. Form.C23H26N6O
Mol. Mass.402.4921
SMILESC1CCN(CC1)C1CCN(CC1)c1nc2ncc(cc2o1)-c1cccc2ccnn12